Target
Prostaglandin G/H synthase 1
Ligand
BDBM50063783
Substrate
Meas. Tech.
ChEMBL_158939 (CHEMBL767827)
IC50
250±n/a nM
Citation
 Janusz, JMYoung, PARidgeway, JMScherz, MWEnzweiler, KWu, LIGan, LDarolia, RMatthews, RSHennes, DKellstein, DEGreen, SATulich, JLRosario-Jansen, TMagrisso, IJWehmeyer, KRKuhlenbeck, DLEichhold, THDobson, RLSirko, SPFarmer, RW New cyclooxygenase-2/5-lipoxygenase inhibitors. 1. 7-tert-buty1-2,3-dihydro-3,3-dimethylbenzofuran derivatives as gastrointestinal safe antiinflammatory and analgesic agents: discovery and variation of the 5-keto substituent. J Med Chem 41:1112-23 (1998)  
Target
Name:
Prostaglandin G/H synthase 1
Synonyms:
COX-1 Cyclooxygenase Cyclooxygenase-1 (COX-1) PTGS1 | Prostaglandin G/H synthase (cyclooxygenase)
Type:
Enzyme
Mol. Mass.:
68692.62
Organism:
Homo sapiens (Human)
Description:
P23219
Residue:
599
  
Inhibitor
Name:
BDBM50063783
Synonyms:
1-(3,5-Di-tert-butyl-4-hydroxy-phenyl)-hex-5-yn-1-one CHEMBL13878 | TEBUFELONE
Type:
Small organic molecule
Emp. Form.:
C20H28O2
Mol. Mass.:
300.4351
SMILES:
CC(C)(C)c1cc(cc(c1O)C(C)(C)C)C(=O)CCCC#C
: