Target
Alpha-1A adrenergic receptor
Ligand
BDBM50064172
Substrate
Meas. Tech.
ChEMBL_34029 (CHEMBL646168)
Ki
>10000±n/a nM
Citation
 Quaglia, WGiannella, MPiergentili, APigini, MBrasili, LDi Toro, RRossetti, LSpampinato, SMelchiorre, C 1'-Benzyl-3,4-dihydrospiro[2H-1- benzothiopyran-2,4'-piperidine] (spipethiane), a potent and highly selective sigma1 ligand. J Med Chem 41:1557-60 (1998)  
Target
Name:
Alpha-1A adrenergic receptor
Synonyms:
ADA1A_RAT Adra1c Alpha-1A adrenoceptor Alpha-1C adrenergic receptor | adrenergic Alpha1A
Type:
Protein
Mol. Mass.:
51620.15
Organism:
Rattus norvegicus (Rat)
Description:
P43140
Residue:
466
  
Inhibitor
Name:
BDBM50064172
Synonyms:
1-benzylspiro[hexahydropyridine-4,2'-(3',4'-dihydro-2'H-thiochromene)] SPIPETHIANE
Type:
Small organic molecule
Emp. Form.:
C20H23NS
Mol. Mass.:
309.468
SMILES:
C(N1CCC2(CC1)CCc1ccccc1S2)c1ccccc1
: