Target
All-trans-retinol dehydrogenase [NAD(+)] ADH4
Ligand
BDBM50064266
Substrate
Meas. Tech.
ChEMBL_31171 (CHEMBL641136)
Ki
11000±n/a nM
Citation
 Schindler, JFBerst, KBPlapp, BV Inhibition of human alcohol dehydrogenases by formamides. J Med Chem 41:1696-701 (1998)  
Target
Name:
All-trans-retinol dehydrogenase [NAD(+)] ADH4
Synonyms:
ADH2 ADH4_HUMAN Alcohol dehydrogenase class II
Type:
PROTEIN
Mol. Mass.:
40228.36
Organism:
Homo sapiens (Human)
Description:
ChEMBL_31171
Residue:
380
  
Inhibitor
Name:
BDBM50064266
Synonyms:
CHEMBL43719 N-Heptyl-formamide
Type:
Small organic molecule
Emp. Form.:
C8H17NO
Mol. Mass.:
143.2267
SMILES:
CCCCCCCNC=O
: