Target
Adenosine receptor A2a
Ligand
BDBM50064702
Substrate
Meas. Tech.
ChEMBL_31376 (CHEMBL644668)
Ki
2.7±n/a nM
Citation
 Baraldi, PGCacciari, BSpalluto, GBergonzoni, MDionisotti, SOngini, EVarani, KBorea, PA Design, synthesis, and biological evaluation of a second generation of pyrazolo[4,3-e]-1,2,4-triazolo[1,5-c]pyrimidines as potent and selective A2A adenosine receptor antagonists. J Med Chem 41:2126-33 (1998)  
Target
Name:
Adenosine receptor A2a
Synonyms:
A2A adenosine receptor (hA2A) ADENOSINE A2 ADORA2 Adenosine A2A receptor (A2AAR)
Type:
G Protein-Coupled Receptor (GPCR)
Mol. Mass.:
44716.46
Organism:
Homo sapiens (Human)
Description:
P29274
Residue:
412
  
Inhibitor
Name:
BDBM50064702
Synonyms:
7-(3-(3,4-dimethoxyphenyl)propyl)-2-(furan-2-yl)-7H-pyrazolo[4,3-e][1,2,4]triazolo[1,5-c]pyrimidin-5-amine CHEMBL69794
Type:
Small organic molecule
Emp. Form.:
C21H21N7O3
Mol. Mass.:
419.4365
SMILES:
COc1ccc(CCCn2ncc3c2nc(N)n2nc(nc32)-c2ccco2)cc1OC
: