Target
Adenosine receptor A2a
Ligand
BDBM50048466
Substrate
Meas. Tech.
ChEMBL_31972 (CHEMBL640525)
Ki
1.1±n/a nM
Citation
 Baraldi, PGCacciari, BSpalluto, GBergonzoni, MDionisotti, SOngini, EVarani, KBorea, PA Design, synthesis, and biological evaluation of a second generation of pyrazolo[4,3-e]-1,2,4-triazolo[1,5-c]pyrimidines as potent and selective A2A adenosine receptor antagonists. J Med Chem 41:2126-33 (1998)  
Target
Name:
Adenosine receptor A2a
Synonyms:
A2A adenosine receptor (hA2A) ADENOSINE A2 ADORA2 Adenosine A2A receptor (A2AAR)
Type:
G Protein-Coupled Receptor (GPCR)
Mol. Mass.:
44716.46
Organism:
Homo sapiens (Human)
Description:
P29274
Residue:
412
  
Inhibitor
Name:
BDBM50048466
Synonyms:
2-(furan-2-yl)-7-phenethyl-7H-pyrazolo[4,3-e][1,2,4]triazolo[1,5-c]pyrimidin-5-amine 2-Furan-2-yl-7-phenethyl-7H-pyrazolo[4,3-e][1,2,4]triazolo[1,5-c]pyrimidin-5-ylamine(SCH 58261) SCH-58261 US11440916, HZ10126
Type:
Small organic molecule
Emp. Form.:
C18H15N7O
Mol. Mass.:
345.358
SMILES:
Nc1nc2n(CCc3ccccc3)ncc2c2nc(nn12)-c1ccco1
: