Target
5-hydroxytryptamine receptor 1B
Ligand
BDBM50064806
Substrate
Meas. Tech.
ChEMBL_1350 (CHEMBL616535)
Ki
37±n/a nM
Citation
 Law, HDukat, MTeitler, MLee, DKMazzocco, LKamboj, RRampersad, VPrisinzano, TGlennon, RA Benzylimidazolines as h5-HT1B/1D serotonin receptor ligands: a structure-affinity investigation. J Med Chem 41:2243-51 (1998)  
Target
Name:
5-hydroxytryptamine receptor 1B
Synonyms:
5-HT-1B 5-HT1B 5HT1B_HUMAN HTR1DB Serotonin (5-HT) receptor Serotonin Receptor 1B
Type:
G Protein-Coupled Receptor (GPCR)
Mol. Mass.:
43579.17
Organism:
Homo sapiens (Human)
Description:
Receptor binding assays were performed using human clone stably expressed in CHO cells
Residue:
390
  
Inhibitor
Name:
BDBM50064806
Synonyms:
2-(4-Isopropyl-2,6-dimethyl-benzyl)-4,5-dihydro-1H-imidazole | CHEMBL308042
Type:
Small organic molecule
Emp. Form.:
C15H22N2
Mol. Mass.:
230.3486
SMILES:
CC(C)c1cc(C)c(CC2=NCCN2)c(C)c1
: