Target
5-hydroxytryptamine receptor 1D
Ligand
BDBM50064814
Substrate
Meas. Tech.
ChEMBL_1719 (CHEMBL875909)
Ki
4390±n/a nM
Citation
 Law, HDukat, MTeitler, MLee, DKMazzocco, LKamboj, RRampersad, VPrisinzano, TGlennon, RA Benzylimidazolines as h5-HT1B/1D serotonin receptor ligands: a structure-affinity investigation. J Med Chem 41:2243-51 (1998)  
Target
Name:
5-hydroxytryptamine receptor 1D
Synonyms:
5-HT-1D 5-HT1D 5HT1D_HUMAN HTR1DA Serotonin (5-HT) receptor | Serotonin Receptor 1D
Type:
G Protein-Coupled Receptor (GPCR)
Mol. Mass.:
41920.63
Organism:
Homo sapiens (Human)
Description:
Receptor binding assays were performed using human clone stably expressed in CHO cells.
Residue:
377
  
Inhibitor
Name:
BDBM50064814
Synonyms:
2-(4-Bromo-benzyl)-4,5-dihydro-1H-imidazole | CHEMBL309976
Type:
Small organic molecule
Emp. Form.:
C10H11BrN2
Mol. Mass.:
239.112
SMILES:
Brc1ccc(CC2=NCCN2)cc1
: