Target
Sigma non-opioid intracellular receptor 1
Ligand
BDBM50000069
Substrate
Meas. Tech.
ChEMBL_200971 (CHEMBL882142)
Ki
0.7±n/a nM
Citation
 John, CSLim, BBVilner, BJGeyer, BCBowen, WD Substituted halogenated arylsulfonamides: a new class of sigma receptor binding tumor imaging agents. J Med Chem 41:2445-50 (1998)  
Target
Name:
Sigma non-opioid intracellular receptor 1
Synonyms:
Aging-associated gene 8 protein SGMR1_HUMAN SIGMAR1 SR31747-binding protein Sigma 1-type opioid receptor Sigma1R | hSigmaR1
Type:
Enzyme Catalytic Domain
Mol. Mass.:
25124.85
Organism:
Homo sapiens (Human)
Description:
Q99720
Residue:
223
  
Inhibitor
Name:
BDBM50000069
Synonyms:
CHEMBL20377 | [2-(3,4-Dichloro-phenyl)-ethyl]-methyl-(2-pyrrolidin-1-yl-ethyl)-amine
Type:
Small organic molecule
Emp. Form.:
C15H22Cl2N2
Mol. Mass.:
301.255
SMILES:
CN(CCN1CCCC1)CCc1ccc(Cl)c(Cl)c1
: