Target
Cytidine deaminase
Ligand
BDBM50065260
Substrate
Meas. Tech.
ChEMBL_52536 (CHEMBL665308)
Ki
38000±n/a nM
Citation
 Jeong, LSBuenger, GMcCormack, JJCooney, DAHao, ZMarquez, VE Carbocyclic analogues of the potent cytidine deaminase inhibitor 1-(beta-D-ribofuranosyl)-1,2-dihydropyrimidin-2-one (zebularine). J Med Chem 41:2572-8 (1998)  
Target
Name:
Cytidine deaminase
Synonyms:
CDA CDD_HUMAN Cytidine deaminase (CDA)
Type:
Ezyme
Mol. Mass.:
16185.04
Organism:
Homo sapiens (Human)
Description:
P32320
Residue:
146
  
Inhibitor
Name:
BDBM50065260
Synonyms:
1-((3R,4S)-3,4-Dihydroxy-5-hydroxymethyl-tetrahydro-furan-2-yl)-1H-pyrimidin-2-one | CHEMBL87519
Type:
Small organic molecule
Emp. Form.:
C9H12N2O5
Mol. Mass.:
228.202
SMILES:
OCC1OC([C@H](O)[C@@H]1O)n1cccnc1=O
: