Target
D(2) dopamine receptor
Ligand
BDBM50065555
Substrate
Meas. Tech.
ChEMBL_60973 (CHEMBL671591)
Ki
8.13±n/a nM
Citation
 Yasunaga, TKimura, TNaito, RKontani, TWanibuchi, FYamashita, HNomura, TTsukamoto, SYamaguchi, TMase, T Synthesis and pharmacological characterization of novel 6-fluorochroman derivatives as potential 5-HT1A receptor antagonists. J Med Chem 41:2765-78 (1998)  
Target
Name:
D(2) dopamine receptor
Synonyms:
DOPAMINE D2 DOPAMINE D2 Short Dopamine D2 receptor Drd2
Type:
G Protein-Coupled Receptor (GPCR)
Mol. Mass.:
50931.60
Organism:
Rattus norvegicus (rat)
Description:
P61169
Residue:
444
  
Inhibitor
Name:
BDBM50065555
Synonyms:
CHEMBL96578 | [2-(6-Fluoro-2-methyl-chroman-8-yloxy)-ethyl]-[2-(4-methoxy-phenyl)-ethyl]-amine
Type:
Small organic molecule
Emp. Form.:
C21H26FNO3
Mol. Mass.:
359.4344
SMILES:
COc1ccc(CCNCCOc2cc(F)cc3CCC(C)Oc23)cc1
: