Target
D(2) dopamine receptor
Ligand
BDBM50065560
Substrate
Meas. Tech.
ChEMBL_60973 (CHEMBL671591)
Ki
3.02±n/a nM
Citation
 Yasunaga, TKimura, TNaito, RKontani, TWanibuchi, FYamashita, HNomura, TTsukamoto, SYamaguchi, TMase, T Synthesis and pharmacological characterization of novel 6-fluorochroman derivatives as potential 5-HT1A receptor antagonists. J Med Chem 41:2765-78 (1998)  
Target
Name:
D(2) dopamine receptor
Synonyms:
DOPAMINE D2 DOPAMINE D2 Short Dopamine D2 receptor Drd2
Type:
G Protein-Coupled Receptor (GPCR)
Mol. Mass.:
50931.60
Organism:
Rattus norvegicus (rat)
Description:
P61169
Residue:
444
  
Inhibitor
Name:
BDBM50065560
Synonyms:
CHEMBL95044 | [2-(6-Fluoro-2-methyl-chroman-8-yloxy)-ethyl]-[5-(4-methoxy-phenyl)-pentyl]-amine
Type:
Small organic molecule
Emp. Form.:
C24H32FNO3
Mol. Mass.:
401.5142
SMILES:
COc1ccc(CCCCCNCCOc2cc(F)cc3CCC(C)Oc23)cc1
: