Target
5-hydroxytryptamine receptor 1A
Ligand
BDBM50065570
Substrate
Meas. Tech.
ChEMBL_1127 (CHEMBL616072)
Ki
24±n/a nM
Citation
 Yasunaga, TKimura, TNaito, RKontani, TWanibuchi, FYamashita, HNomura, TTsukamoto, SYamaguchi, TMase, T Synthesis and pharmacological characterization of novel 6-fluorochroman derivatives as potential 5-HT1A receptor antagonists. J Med Chem 41:2765-78 (1998)  
Target
Name:
5-hydroxytryptamine receptor 1A
Synonyms:
5-HT-1A 5-HT1A 5-hydroxytryptamine receptor 1A (5HT1A) 5ht1a Htr1a Serotonin 1a (5-HT1a) receptor/Adrenergic receptor alpha-1 | Serotonin receptor 1A
Type:
G Protein-Coupled Receptor (GPCR)
Mol. Mass.:
46445.29
Organism:
Rattus norvegicus (rat)
Description:
Binding assays were performed using rat hippocampal membranes.
Residue:
422
  
Inhibitor
Name:
BDBM50065570
Synonyms:
6-Fluoro-8-{2-[4-(2-methoxy-phenyl)-butylamino]-ethoxy}-chroman-4-one | CHEMBL96901
Type:
Small organic molecule
Emp. Form.:
C22H26FNO4
Mol. Mass.:
387.4445
SMILES:
COc1ccccc1CCCCNCCOc1cc(F)cc2C(=O)CCOc12
: