Target
Acetyl-CoA carboxylase 2
Ligand
BDBM50511117
Substrate
Meas. Tech.
ChEMBL_1843857 (CHEMBL4344284)
IC50
3.0±n/a nM
Citation
 Romero, FAJones, CTXu, YFenaux, MHalcomb, RL The Race to Bash NASH: Emerging Targets and Drug Development in a Complex Liver Disease. J Med Chem 63:5031-5073 (2020)  
Target
Name:
Acetyl-CoA carboxylase 2
Synonyms:
ACACB ACC-beta ACCB Acetyl-CoA carboxylase 2 Acetyl-CoA carboxylase 2 (ACC2)
Type:
Protein
Mol. Mass.:
276535.21
Organism:
Homo sapiens (Human)
Description:
O00763
Residue:
2458
  
Inhibitor
Name:
BDBM50511117
Synonyms:
CHEMBL4557289
Type:
Small organic molecule
Emp. Form.:
C33H31N3O6
Mol. Mass.:
565.6157
SMILES:
COc1cc(cc2n(cc(C)c12)C1CC1)C(=O)N1CCC2(CC1)CC(=O)c1cc(ccc1O2)-c1cncc(c1)C(O)=O
: