Target
Interleukin-1 receptor-associated kinase 4
Ligand
BDBM50511360
Substrate
Meas. Tech.
ChEMBL_1844703 (CHEMBL4345130)
Ki
1.9±n/a nM
Citation
 Rajapaksa, NSGobbi, ADrobnick, JDo, SKolesnikov, ALiang, JChen, YSujatha-Bhaskar, SHuang, ZBrightbill, HFrancis, RYu, CChoo, EFDeMent, KRan, YAn, LEmson, CMaher, JWai, JMcKenzie, BSLupardus, PJZarrin, AAKiefer, JRBryan, MC Discovery of Potent Benzolactam IRAK4 Inhibitors with Robust in Vivo Activity. ACS Med Chem Lett 11:327-333 (2020)  
Target
Name:
Interleukin-1 receptor-associated kinase 4
Synonyms:
IRAK-4 IRAK4_HUMAN Interleukin-1 receptor-associated kinase 4 (IRAK4) | Renal carcinoma antigen NY-REN-64
Type:
Protein
Mol. Mass.:
51519.08
Organism:
Homo sapiens (Human)
Description:
Q9NWZ3
Residue:
460
  
Inhibitor
Name:
BDBM50511360
Synonyms:
CHEMBL4556091
Type:
Small organic molecule
Emp. Form.:
C28H34FN7O3
Mol. Mass.:
535.6131
SMILES:
CC(C)(O)[C@H](F)CN1Cc2cc(NC(=O)c3cnn4cccnc34)c(cc2C1=O)N1CCC(CC1)N1CCC1
: