Target
Prothrombin
Ligand
BDBM50066332
Substrate
Meas. Tech.
ChEMBL_208318 (CHEMBL812836)
Ki
0.5±n/a nM
Citation
 Tucker, TJBrady, SFLumma, WCLewis, SDGardell, SJNaylor-Olsen, AMYan, YSisko, JTStauffer, KJLucas, BJLynch, JJCook, JJStranieri, MTHolahan, MALyle, EABaskin, EPChen, IWDancheck, KBKrueger, JACooper, CMVacca, JP Design and synthesis of a series of potent and orally bioavailable noncovalent thrombin inhibitors that utilize nonbasic groups in the P1 position. J Med Chem 41:3210-9 (1998)  
Target
Name:
Prothrombin
Synonyms:
Activation peptide fragment 1 Coagulation factor II Prothrombin precursor Thrombin heavy chain | Thrombin light chain
Type:
Protein
Mol. Mass.:
70029.57
Organism:
Homo sapiens (Human)
Description:
P00734
Residue:
622
  
Inhibitor
Name:
BDBM50066332
Synonyms:
(S)-1-((R)-2-Amino-2-cyclohexyl-acetyl)-pyrrolidine-2-carboxylic acid 2-carbamoylmethoxy-5-chloro-benzylamide | CHEMBL108717
Type:
Small organic molecule
Emp. Form.:
C22H31ClN4O4
Mol. Mass.:
450.959
SMILES:
N[C@H](C1CCCCC1)C(=O)N1CCC[C@H]1C(=O)NCc1cc(Cl)ccc1OCC(N)=O
: