Target
Poly [ADP-ribose] polymerase 2
Ligand
BDBM50511566
Substrate
Meas. Tech.
ChEMBL_1844996 (CHEMBL4345423)
IC50
2717±n/a nM
Citation
 Shirai, FMizutani, AYashiroda, YTsumura, TKano, YMuramatsu, YChikada, TYuki, HNiwa, HSato, SWashizuka, KKoda, YMazaki, YJang, MKYoshida, HNagamori, AOkue, MWatanabe, TKitamura, KShitara, EHonma, TUmehara, TShirouzu, MFukami, TSeimiya, HYoshida, MKoyama, H Design and Discovery of an Orally Efficacious Spiroindolinone-Based Tankyrase Inhibitor for the Treatment of Colon Cancer. J Med Chem 63:4183-4204 (2020)  
Target
Name:
Poly [ADP-ribose] polymerase 2
Synonyms:
(ARTD2 or PARP2) ADPRTL2 PARP2_HUMAN Poly [ADP-ribose] polymerase 2 (PARP2)
Type:
Enzyme
Mol. Mass.:
66225.70
Organism:
Homo sapiens (Human)
Description:
Q9UGN5
Residue:
583
  
Inhibitor
Name:
BDBM50511566
Synonyms:
CHEMBL4448872
Type:
Small organic molecule
Emp. Form.:
C22H26F2N4O2
Mol. Mass.:
416.4642
SMILES:
OCCN1CC2(CCN(CC2)c2nc3CCCCc3c(=O)[nH]2)c2c1cc(F)cc2F
: