Target
B-cell lymphoma 6 protein
Ligand
BDBM50511643
Substrate
Meas. Tech.
ChEMBL_1845269 (CHEMBL4345696)
IC50
400±n/a nM
Target
Name:
B-cell lymphoma 6 protein
Synonyms:
B-cell lymphoma 5 protein BCL-5 BCL5 BCL6_HUMAN LAZ3 ZBTB27 Zinc finger and BTB domain-containing protein 27 | Zinc finger protein 51
Type:
PROTEIN
Mol. Mass.:
78866.89
Organism:
Homo sapiens
Description:
ChEMBL_117695
Residue:
706
  
Inhibitor
Name:
BDBM50511643
Synonyms:
CHEMBL4482923
Type:
Small organic molecule
Emp. Form.:
C23H28ClF3N6O2
Mol. Mass.:
512.956
SMILES:
Cn1c2ccc(Nc3nc(ncc3Cl)N3CCCC(C3)C(F)(F)F)cc2n(CCC(C)(C)O)c1=O
: