Target
B-cell lymphoma 6 protein
Ligand
BDBM50511648
Substrate
Meas. Tech.
ChEMBL_1845269 (CHEMBL4345696)
IC50
270±n/a nM
Target
Name:
B-cell lymphoma 6 protein
Synonyms:
B-cell lymphoma 5 protein BCL-5 BCL5 BCL6_HUMAN LAZ3 ZBTB27 Zinc finger and BTB domain-containing protein 27 | Zinc finger protein 51
Type:
PROTEIN
Mol. Mass.:
78866.89
Organism:
Homo sapiens
Description:
ChEMBL_117695
Residue:
706
  
Inhibitor
Name:
BDBM50511648
Synonyms:
CHEMBL4463841
Type:
Small organic molecule
Emp. Form.:
C21H27ClN6O3
Mol. Mass.:
446.93
SMILES:
Cn1c2ccc(Nc3nc(ncc3Cl)N3CCOCC3)cc2n(CCC(C)(C)O)c1=O
: