Target
Prostaglandin G/H synthase 2
Ligand
BDBM50009859
Substrate
Meas. Tech.
ChEMBL_159908 (CHEMBL768957)
IC50
30000±n/a nM
Citation
 Janusz, JMYoung, PARidgeway, JMScherz, MWEnzweiler, KWu, LIGan, LChen, JKellstein, DEGreen, SATulich, JLRosario-Jansen, TMagrisso, IJWehmeyer, KRKuhlenbeck, DLEichhold, THDobson, RL New cyclooxygenase-2/5-lipoxygenase inhibitors. 3. 7-tert-butyl-2, 3-dihydro-3,3-dimethylbenzofuran derivatives as gastrointestinal safe antiinflammatory and analgesic agents: variations at the 5 position. J Med Chem 41:3515-29 (1998)  
Target
Name:
Prostaglandin G/H synthase 2
Synonyms:
COX2 Cyclooxygenase 2 (COX-2) Cyclooxygenase-2 (COX-2 AA) Cyclooxygenase-2 (COX-2) PGH2_HUMAN PHS II Prostaglandin E synthase/G/H synthase 2 Prostaglandin-endoperoxide synthase 2
Type:
Enzyme
Mol. Mass.:
69003.89
Organism:
Homo sapiens (Human)
Description:
Recombinant Cox-2 provided by Cayman (Cayman Chemical Co.,Ann Arbor, MI).
Residue:
604
  
Inhibitor
Name:
BDBM50009859
Synonyms:
(+-)-2-(p-isobutylphenyl)propionic acid (+-)-ibuprofen (4-isobutylphenyl)-alpha-methylacetic acid 2-(4-isobutylphenyl)propanoic acid 4-isobutylhydratropic acid Brufen IBUPROFEN LYSINE Ibuprofen (1) alpha-(4-isobutylphenyl)propionic acid | alpha-(p-isobutylphenyl)propionic acid
Type:
Small organic molecule
Emp. Form.:
C13H18O2
Mol. Mass.:
206.2808
SMILES:
CC(C)Cc1ccc(cc1)C(C)C(O)=O
: