Target
Prothrombin
Ligand
BDBM50066634
Substrate
Meas. Tech.
ChEMBL_208533 (CHEMBL813627)
Ki
190±n/a nM
Citation
 Phillips, GBBuckman, BODavey, DDEagen, KAGuilford, WJHinchman, JHo, EKoovakkat, SLiang, ALight, DRMohan, RNg, HPPost, JMShaw, KJSmith, DSubramanyam, BSullivan, METrinh, LVergona, RWalters, JWhite, KWhitlow, MWu, SXu, WMorrissey, MM Discovery of N-[2-[5-[Amino(imino)methyl]-2-hydroxyphenoxy]-3, 5-difluoro-6-[3-(4, 5-dihydro-1-methyl-1H-imidazol-2-yl)phenoxy]pyridin-4-yl]-N-methylgl y cine (ZK-807834): a potent, selective, and orally active inhibitor of the blood coagulation enzyme factor Xa. J Med Chem 41:3557-62 (1998)  
Target
Name:
Prothrombin
Synonyms:
Activation peptide fragment 1 Coagulation factor II Prothrombin precursor Thrombin heavy chain | Thrombin light chain
Type:
Protein
Mol. Mass.:
70029.57
Organism:
Homo sapiens (Human)
Description:
P00734
Residue:
622
  
Inhibitor
Name:
BDBM50066634
Synonyms:
(4-{2-(5-Carbamimidoyl-2-hydroxy-phenoxy)-3,5-difluoro-6-[3-(1-methyl-4,5-dihydro-1H-imidazol-2-yl)-phenoxy]-pyridin-4-yloxy}-piperidin-1-yl)-acetic acid ethyl ester | CHEMBL331690
Type:
Small organic molecule
Emp. Form.:
C31H34F2N6O6
Mol. Mass.:
624.6351
SMILES:
CCOC(=O)CN1CCC(CC1)Oc1c(F)c(Oc2cccc(c2)C2=NCCN2C)nc(Oc2cc(ccc2O)C(N)=N)c1F
: