Target
Coagulation factor X
Ligand
BDBM50066618
Substrate
Meas. Tech.
ChEMBL_48821 (CHEMBL661794)
Ki
400±n/a nM
Citation
 Phillips, GBBuckman, BODavey, DDEagen, KAGuilford, WJHinchman, JHo, EKoovakkat, SLiang, ALight, DRMohan, RNg, HPPost, JMShaw, KJSmith, DSubramanyam, BSullivan, METrinh, LVergona, RWalters, JWhite, KWhitlow, MWu, SXu, WMorrissey, MM Discovery of N-[2-[5-[Amino(imino)methyl]-2-hydroxyphenoxy]-3, 5-difluoro-6-[3-(4, 5-dihydro-1-methyl-1H-imidazol-2-yl)phenoxy]pyridin-4-yl]-N-methylgl y cine (ZK-807834): a potent, selective, and orally active inhibitor of the blood coagulation enzyme factor Xa. J Med Chem 41:3557-62 (1998)  
Target
Name:
Coagulation factor X
Synonyms:
Activated coagulation factor X (FXa) Coagulation factor X precursor F10 Factor X heavy chain Factor Xa Stuart-Prower factor
Type:
Enzyme
Mol. Mass.:
54726.60
Organism:
Homo sapiens (Human)
Description:
Residue:
488
  
Inhibitor
Name:
BDBM50066618
Synonyms:
4-{6-[4-amino(imino)methylphenoxy]-2-pyridyloxy}phenyl-iminomethanamine | CHEMBL298415
Type:
Small organic molecule
Emp. Form.:
C19H17N5O2
Mol. Mass.:
347.3706
SMILES:
NC(=N)c1ccc(Oc2cccc(Oc3ccc(cc3)C(N)=N)n2)cc1
: