Target
Cathepsin K
Ligand
BDBM50066645
Substrate
Meas. Tech.
ChEMBL_48326 (CHEMBL663316)
Ki
25±n/a nM
Citation
 Marquis, RWYamashita, DSRu, YLoCastro, SMOh, HJErhard, KFDesJarlais, RLHead, MSSmith, WWZhao, BJanson, CAAbdel-Meguid, SSTomaszek, TALevy, MAVeber, DF Conformationally constrained 1,3-diamino ketones: a series of potent inhibitors of the cysteine protease cathepsin K. J Med Chem 41:3563-7 (1998)  
Target
Name:
Cathepsin K
Synonyms:
CATK_HUMAN CTSO Cathepsin O Cathepsin X
Type:
Enzyme
Mol. Mass.:
36975.68
Organism:
Homo sapiens (Human)
Description:
P43235
Residue:
329
  
Inhibitor
Name:
BDBM50066645
Synonyms:
CHEMBL432634 | {(S)-3-Methyl-1-[1-(4-methyl-pentyl)-3-oxo-piperidin-4-ylcarbamoyl]-butyl}-carbamic acid benzyl ester
Type:
Small organic molecule
Emp. Form.:
C25H39N3O4
Mol. Mass.:
445.5949
SMILES:
CC(C)CCCN1CCC(NC(=O)[C@H](CC(C)C)NC(=O)OCc2ccccc2)C(=O)C1
: