Target
Adenosine receptor A2b
Ligand
BDBM50511964
Substrate
Meas. Tech.
ChEMBL_1846291 (CHEMBL4346832)
Ki
0.352000±n/a nM
Citation
 Jiang, JSeel, CJTemirak, ANamasivayam, VArridu, ASchabikowski, JBaqi, YHinz, SHockemeyer, JMüller, CE A J Med Chem 62:4032-4055 (2019)  
Target
Name:
Adenosine receptor A2b
Synonyms:
AA2BR_HUMAN ADORA2B Adenosine receptors A2b | Adenosine receptors; A2a & A2b
Type:
G Protein-Coupled Receptor (GPCR)
Mol. Mass.:
36341.22
Organism:
Homo sapiens (Human)
Description:
Residue:
332
  
Inhibitor
Name:
BDBM50511964
Synonyms:
CHEMBL4530074
Type:
Small organic molecule
Emp. Form.:
C25H27ClN6O5S
Mol. Mass.:
559.037
SMILES:
CCCn1c(=O)[nH]c2nc([nH]c2c1=O)-c1ccc(cc1)S(=O)(=O)N1CCN(CC1)c1ccc(OC)c(Cl)c1
: