Target
Polyunsaturated fatty acid lipoxygenase ALOX15B
Ligand
BDBM50512137
Substrate
Meas. Tech.
ChEMBL_1847903 (CHEMBL4348444)
IC50
600±n/a nM
Citation
 Lu, GQLi, XYMohamed O, KWang, DMeng, FH Design, synthesis and biological evaluation of novel uracil derivatives bearing 1, 2, 3-triazole moiety as thymidylate synthase (TS) inhibitors and as potential antitumor drugs. Eur J Med Chem 171:282-296 (2019)  
Target
Name:
Polyunsaturated fatty acid lipoxygenase ALOX15B
Synonyms:
Alox15b LX15B_RAT
Type:
PROTEIN
Mol. Mass.:
76140.88
Organism:
Rattus norvegicus
Description:
ChEMBL_12426
Residue:
677
  
Inhibitor
Name:
BDBM50512137
Synonyms:
CHEMBL4457367
Type:
Small organic molecule
Emp. Form.:
C18H13ClN6O4S
Mol. Mass.:
444.852
SMILES:
Clc1cccc(c1)-n1cc(nn1)-c1ccccc1NS(=O)(=O)c1c[nH]c(=O)[nH]c1=O
: