Target
Proto-oncogene tyrosine-protein kinase ROS
Ligand
BDBM50512149
Substrate
Meas. Tech.
ChEMBL_1847937 (CHEMBL4348478)
IC50
0.430000±n/a nM
Citation
 Lei, HJiang, NMiao, XXing, LGuo, MLiu, YXu, HGong, PZuo, DZhai, X Discovery of novel mutant-combating ALK and ROS1 dual inhibitors bearing imidazolidin-2-one moiety with reasonable PK properties. Eur J Med Chem 171:297-309 (2019)  
Target
Name:
Proto-oncogene tyrosine-protein kinase ROS
Synonyms:
MCF3 Proto-oncogene c-Ros-1 ROS1 Receptor tyrosine kinase c-ros oncogene 1 c-Ros receptor tyrosine kinase
Type:
Enzyme
Mol. Mass.:
263897.39
Organism:
Homo sapiens (Human)
Description:
P08922
Residue:
2347
  
Inhibitor
Name:
BDBM50512149
Synonyms:
CHEMBL4470529
Type:
Small organic molecule
Emp. Form.:
C27H34ClN7O4S
Mol. Mass.:
588.121
SMILES:
COc1cc(ccc1Nc1ncc(Cl)c(Nc2ccccc2S(=O)(=O)C(C)C)n1)N1CCN(CCN(C)C)C1=O
: