Target
Adenosine receptor A3
Ligand
BDBM50067096
Substrate
Meas. Tech.
ChEMBL_31996 (CHEMBL646593)
Ki
200000±n/a nM
Citation
 van Muijlwijk-Koezen, JETimmerman, HLink, Rvan der Goot, HIjzerman, AP A novel class of adenosine A3 receptor ligands. 2. Structure affinity profile of a series of isoquinoline and quinazoline compounds. J Med Chem 41:3994-4000 (1998)  
Target
Name:
Adenosine receptor A3
Synonyms:
A3 adenosine receptor (hA3) ADORA3 | Adenosine A3 receptor (A3AR)
Type:
G Protein-Coupled Receptor (GPCR)
Mol. Mass.:
36197.32
Organism:
Homo sapiens (Human)
Description:
P0DMS8
Residue:
318
  
Inhibitor
Name:
BDBM50067096
Synonyms:
CHEMBL71053 N-(3-Pyridin-2-yl-isoquinolin-1-yl)-benzamide VUF-8507
Type:
Small organic molecule
Emp. Form.:
C21H15N3O
Mol. Mass.:
325.3633
SMILES:
O=C(Nc1nc(cc2ccccc12)-c1ccccn1)c1ccccc1
: