Target
Integrin alpha-IIb/beta-3
Ligand
BDBM50067220
Substrate
Meas. Tech.
ChEMBL_70306 (CHEMBL677853)
IC50
0.13±n/a nM
Citation
 Okumura, KShimazaki, TAoki, YYamashita, HTanaka, EBanba, SYazawa, KKibayashi, KBanno, H New platelet fibrinogen receptor glycoprotein IIb-IIIa antagonists: orally active series of N-alkylated amidines with a 6,6-bicyclic template. J Med Chem 41:4036-52 (1998)  
Target
Name:
Integrin alpha-IIb/beta-3
Synonyms:
Glycoprotein IIb/IIIa
Type:
Mol. Mass.:
Description:
ASSAY_ID of EBI is 30109
Components:
This complex has 2 components.
Component 1
Name:
Integrin beta-3
Synonyms:
CD_antigen=CD61 GPIIIa ITGB3 Platelet membrane glycoprotein IIIa
Type:
Protein
Mol. Mass.:
87038.91
Organism:
Homo sapiens (Human)
Description:
P05106
Residue:
788
  
Component 2
Name:
Integrin alpha-IIb
Synonyms:
CD_antigen=CD41 GPIIb Glycoprotein IIb ITGA2B Integrin alpha-IIb heavy chain Integrin alpha-IIb light chain, form 2 Integrin alpha-V/beta-3 and alpha-IIb/beta 3 | Platelet membrane glycoprotein IIb
Type:
Protein
Mol. Mass.:
113354.85
Organism:
Homo sapiens (Human)
Description:
P08514
Residue:
1039
  
Inhibitor
Name:
BDBM50067220
Synonyms:
CHEMBL130405 | {7-[4-(N-Propylcarbamimidoyl)-benzoylamino]-1,2,3,4-tetrahydro-naphthalen-2-yl}-acetic acid
Type:
Small organic molecule
Emp. Form.:
C23H27N3O3
Mol. Mass.:
393.4788
SMILES:
CCCNC(=N)c1ccc(cc1)C(=O)Nc1ccc2CCC(CC(O)=O)Cc2c1
: