Target
Aldo-keto reductase family 1 member B1
Ligand
BDBM50009777
Substrate
Meas. Tech.
ChEMBL_31797 (CHEMBL643203)
IC50
21±n/a nM
Citation
 Negoro, TMurata, MUeda, SFujitani, BOno, YKuromiya, AKomiya, MSuzuki, KMatsumoto, J Novel, highly potent aldose reductase inhibitors: (R)-(-)-2-(4-bromo-2-fluorobenzyl)-1,2,3,4- tetrahydropyrrolo[1,2-a]pyrazine -4-spiro-3'-pyrrolidine-1,2',3,5'-tetrone (AS-3201) and its congeners. J Med Chem 41:4118-29 (1998)  
Target
Name:
Aldo-keto reductase family 1 member B1
Synonyms:
AKR1B1 ALR2 Aldose reductase
Type:
PROTEIN
Mol. Mass.:
35865.31
Organism:
Sus scrofa
Description:
ChEMBL_502637
Residue:
316
  
Inhibitor
Name:
BDBM50009777
Synonyms:
(ponalrestat)[3-(4-Bromo-2-fluoro-benzyl)-4-oxo-3,4-dihydro-phthalazin-1-yl]-acetic acid Ponalrestat [3-(4-Bromo-2-fluoro-benzyl)-4-oxo-3,4-dihydro-phthalazin-1-yl]-acetic acid | [3-(4-Bromo-2-fluoro-benzyl)-4-oxo-3,4-dihydro-phthalazin-1-yl]-acetic acid(ponalrestat)
Type:
Small organic molecule
Emp. Form.:
C17H12BrFN2O3
Mol. Mass.:
391.191
SMILES:
OC(=O)Cc1nn(Cc2ccc(Br)cc2F)c(=O)c2ccccc12
: