Target
Prothrombin
Ligand
BDBM50067526
Substrate
Meas. Tech.
ChEMBL_210593 (CHEMBL816560)
Ki
>1000000±n/a nM
Citation
 Gabriel, BStubbs, MTBergner, AHauptmann, JBode, WStürzebecher, JMoroder, L Design of benzamidine-type inhibitors of factor Xa. J Med Chem 41:4240-50 (1998)  
Target
Name:
Prothrombin
Synonyms:
Activation peptide fragment 1 Coagulation factor II Prothrombin Thrombin Thrombin light chain
Type:
Enzyme
Mol. Mass.:
70502.73
Organism:
Bos taurus (Bovine)
Description:
P00735
Residue:
625
  
Inhibitor
Name:
BDBM50067526
Synonyms:
2-[2-(4-Carbamimidoyl-benzenesulfonylamino)-acetylamino]-3-(4-carbamimidoyl-phenyl)-propionic acid | CHEMBL341933
Type:
Small organic molecule
Emp. Form.:
C19H22N6O5S
Mol. Mass.:
446.48
SMILES:
NC(=N)c1ccc(CC(NC(=O)CNS(=O)(=O)c2ccc(cc2)C(N)=N)C(O)=O)cc1
: