Target
Reverse transcriptase
Ligand
BDBM222178
Substrate
Meas. Tech.
ChEMBL_1849531 (CHEMBL4350072)
IC50
>10000±n/a nM
Citation
 Overacker, RDBanerjee, SNeuhaus, GFMilicevic Sephton, SHerrmann, AStrother, JABrack-Werner, RBlakemore, PRLoesgen, S Biological evaluation of molecules of the azaBINOL class as antiviral agents: Inhibition of HIV-1 RNase H activity by 7-isopropoxy-8-(naphth-1-yl)quinoline. Bioorg Med Chem 27:3595-3604 (2019)  
Target
Name:
Reverse transcriptase
Synonyms:
Reverse transcriptase | pol
Type:
PROTEIN
Mol. Mass.:
63554.92
Organism:
Moloney murine leukemia virus
Description:
ChEMBL_119661
Residue:
559
  
Inhibitor
Name:
BDBM222178
Synonyms:
Rilpivirine
Type:
Small organic molecule
Emp. Form.:
C22H18N6
Mol. Mass.:
366.4185
SMILES:
Cc1cc(\C=C\C#N)cc(C)c1Nc1ccnc(Nc2ccc(cc2)C#N)n1
: