Target
Androgen receptor
Ligand
BDBM50067671
Substrate
Meas. Tech.
ChEMBL_36277 (CHEMBL651951)
Ki
887±n/a nM
Citation
 Tegley, CMZhi, LMarschke, KBGottardis, MMYang, QJones, TK 5-Benzylidene 1,2-dihydrochromeno[3,4-f]quinolines, a novel class of nonsteroidal human progesterone receptor agonists. J Med Chem 41:4354-9 (1998)  
Target
Name:
Androgen receptor
Synonyms:
ANDR_HUMAN Androgen Receptor Androgen receptor/Baculoviral IAP repeat-containing protein 2 Dihydrotestosterone receptor Nuclear receptor subfamily 3 group C member 4
Type:
Receptor
Mol. Mass.:
99185.27
Organism:
Homo sapiens (Human)
Description:
CHO cells were stably transfected with human AR gene.
Residue:
920
  
Inhibitor
Name:
BDBM50067671
Synonyms:
5-[1-(2,5-Difluoro-phenyl)-meth-(Z)-ylidene]-2,2,4-trimethyl-2,5-dihydro-1H-6-oxa-1-aza-chrysene | CHEMBL137103
Type:
Small organic molecule
Emp. Form.:
C26H21F2NO
Mol. Mass.:
401.4478
SMILES:
CC1=CC(C)(C)Nc2ccc3-c4ccccc4O\C(=C/c4cc(F)ccc4F)c3c12
: