Target
Glucocorticoid receptor
Ligand
BDBM50067686
Substrate
Meas. Tech.
ChEMBL_71402 (CHEMBL680188)
Ki
237±n/a nM
Citation
 Tegley, CMZhi, LMarschke, KBGottardis, MMYang, QJones, TK 5-Benzylidene 1,2-dihydrochromeno[3,4-f]quinolines, a novel class of nonsteroidal human progesterone receptor agonists. J Med Chem 41:4354-9 (1998)  
Target
Name:
Glucocorticoid receptor
Synonyms:
GCR_HUMAN GRL Glucocorticoid receptor (GRFP) Nuclear receptor subfamily 3 group C member 1
Type:
Enzyme
Mol. Mass.:
85656.87
Organism:
Homo sapiens (Human)
Description:
P04150
Residue:
777
  
Inhibitor
Name:
BDBM50067686
Synonyms:
5-[1-(3,4-Difluoro-phenyl)-meth-(Z)-ylidene]-2,2,4-trimethyl-2,5-dihydro-1H-6-oxa-1-aza-chrysene | CHEMBL342426
Type:
Small organic molecule
Emp. Form.:
C26H21F2NO
Mol. Mass.:
401.4478
SMILES:
CC1=CC(C)(C)Nc2ccc3-c4ccccc4O\C(=C/c4ccc(F)c(F)c4)c3c12
: