Target
Mineralocorticoid receptor
Ligand
BDBM50067670
Substrate
Meas. Tech.
ChEMBL_44199 (CHEMBL654292)
IC50
>10000±n/a nM
Citation
 Tegley, CMZhi, LMarschke, KBGottardis, MMYang, QJones, TK 5-Benzylidene 1,2-dihydrochromeno[3,4-f]quinolines, a novel class of nonsteroidal human progesterone receptor agonists. J Med Chem 41:4354-9 (1998)  
Target
Name:
Mineralocorticoid receptor
Synonyms:
MCR MLR NR3C2 | Nuclear receptor subfamily 3 group C member 2
Type:
Enzyme
Mol. Mass.:
107076.42
Organism:
Homo sapiens (Human)
Description:
P08235
Residue:
984
  
Inhibitor
Name:
BDBM50067670
Synonyms:
5-[1-(3-Fluoro-phenyl)-meth-(Z)-ylidene]-2,2,4-trimethyl-2,5-dihydro-1H-6-oxa-1-aza-chrysene | CHEMBL32812
Type:
Small organic molecule
Emp. Form.:
C26H22FNO
Mol. Mass.:
383.4574
SMILES:
CC1=CC(C)(C)Nc2ccc3-c4ccccc4O\C(=C/c4cccc(F)c4)c3c12
: