Target
Progesterone receptor
Ligand
BDBM50067673
Substrate
Meas. Tech.
ChEMBL_159549 (CHEMBL765837)
Ki
53.3±n/a nM
Citation
 Tegley, CMZhi, LMarschke, KBGottardis, MMYang, QJones, TK 5-Benzylidene 1,2-dihydrochromeno[3,4-f]quinolines, a novel class of nonsteroidal human progesterone receptor agonists. J Med Chem 41:4354-9 (1998)  
Target
Name:
Progesterone receptor
Synonyms:
NR3C3 PGR PRGR_HUMAN | progesterone
Type:
Protein
Mol. Mass.:
98979.52
Organism:
Homo sapiens (Human)
Description:
P06401
Residue:
933
  
Inhibitor
Name:
BDBM50067673
Synonyms:
5-[1-(3-Methoxy-phenyl)-meth-(Z)-ylidene]-2,2,4-trimethyl-2,5-dihydro-1H-6-oxa-1-aza-chrysene | CHEMBL139631
Type:
Small organic molecule
Emp. Form.:
C27H25NO2
Mol. Mass.:
395.4929
SMILES:
COc1cccc(\C=C2/Oc3ccccc3-c3ccc4NC(C)(C)C=C(C)c4c23)c1
: