Target
Progesterone receptor
Ligand
BDBM50067668
Substrate
Meas. Tech.
ChEMBL_44189 (CHEMBL653488)
EC50
24.4±n/a nM
Citation
 Tegley, CMZhi, LMarschke, KBGottardis, MMYang, QJones, TK 5-Benzylidene 1,2-dihydrochromeno[3,4-f]quinolines, a novel class of nonsteroidal human progesterone receptor agonists. J Med Chem 41:4354-9 (1998)  
Target
Name:
Progesterone receptor
Synonyms:
NR3C3 PGR PRGR_HUMAN | progesterone
Type:
Protein
Mol. Mass.:
98979.52
Organism:
Homo sapiens (Human)
Description:
P06401
Residue:
933
  
Inhibitor
Name:
BDBM50067668
Synonyms:
2,2,4-Trimethyl-5-[1-phenyl-meth-(Z)-ylidene]-2,5-dihydro-1H-6-oxa-1-aza-chrysene | CHEMBL134421
Type:
Small organic molecule
Emp. Form.:
C26H23NO
Mol. Mass.:
365.4669
SMILES:
CC1=CC(C)(C)Nc2ccc3-c4ccccc4O\C(=C/c4ccccc4)c3c12
: