Target
Beta-lactamase
Ligand
BDBM50067887
Substrate
Meas. Tech.
ChEMBL_35526 (CHEMBL649552)
IC50
5000±n/a nM
Citation
 Weston, GSBlázquez, JBaquero, FShoichet, BK Structure-based enhancement of boronic acid-based inhibitors of AmpC beta-lactamase. J Med Chem 41:4577-86 (1998)  
Target
Name:
Beta-lactamase
Synonyms:
AMPC_ECOLI Beta-lactamase (AmpC) Cephalosporinase ampA | ampC
Type:
Protien
Mol. Mass.:
41561.62
Organism:
Escherichia coli
Description:
P00811
Residue:
377
  
Inhibitor
Name:
BDBM50067887
Synonyms:
3-NITROPHENYLBORONIC ACID 3-Nitrophenyl boronic acid CHEMBL20945 | m-nitophenyl boronic acid
Type:
Small organic molecule
Emp. Form.:
C6H6BNO4
Mol. Mass.:
166.927
SMILES:
O[B-](=[OH+])c1cccc(c1)[N+]([O-])=O
: