Target
Sigma non-opioid intracellular receptor 1
Ligand
BDBM50068455
Substrate
Meas. Tech.
ChEMBL_200964 (CHEMBL802052)
Ki
0.32±n/a nM
Citation
 Zhang, YWilliams, WTorrence-Campbell, CBowen, WDRice, KC Characterization of novel N,N'-disubstituted piperazines as sigma receptor ligands. J Med Chem 41:4950-7 (1999)  
Target
Name:
Sigma non-opioid intracellular receptor 1
Synonyms:
Aging-associated gene 8 protein SGMR1_HUMAN SIGMAR1 SR31747-binding protein Sigma 1-type opioid receptor Sigma1R | hSigmaR1
Type:
Enzyme Catalytic Domain
Mol. Mass.:
25124.85
Organism:
Homo sapiens (Human)
Description:
Q99720
Residue:
223
  
Inhibitor
Name:
BDBM50068455
Synonyms:
CHEMBL342809 | {4-Oxo-4-[4-(3-phenyl-propyl)-piperazin-1-yl]-butyl}-carbamic acid tert-butyl ester
Type:
Small organic molecule
Emp. Form.:
C22H35N3O3
Mol. Mass.:
389.5316
SMILES:
CC(C)(C)OC(=O)NCCCC(=O)N1CCN(CCCc2ccccc2)CC1
: