Target
5-hydroxytryptamine receptor 2A
Ligand
BDBM50068612
Substrate
Meas. Tech.
ChEMBL_2287 (CHEMBL617072)
Ki
0.04±n/a nM
Citation
 Parker, MAMarona-Lewicka, DLucaites, VLNelson, DLNichols, DE A novel (benzodifuranyl)aminoalkane with extremely potent activity at the 5-HT2A receptor. J Med Chem 41:5148-9 (1999)  
Target
Name:
5-hydroxytryptamine receptor 2A
Synonyms:
5-HT-2 5-HT2A 5-hydroxytryptamine receptor 2A (5HT-2A) 5HT2A_HUMAN HTR2A | Serotonin receptor 2A
Type:
undefined
Mol. Mass.:
52607.65
Organism:
Homo sapiens (Human)
Description:
P28223
Residue:
471
  
Inhibitor
Name:
BDBM50068612
Synonyms:
2-(8-Bromo-benzo[1,2-b;4,5-b']difuran-4-yl)-1-methyl-ethylamine | CHEMBL149024
Type:
Small organic molecule
Emp. Form.:
C13H12BrNO2
Mol. Mass.:
294.144
SMILES:
CC(N)Cc1c2ccoc2c(Br)c2ccoc12
: