Target
Chymase
Ligand
BDBM50068909
Substrate
Meas. Tech.
ChEBML_49442
Ki
17±n/a nM
Citation
 Eda, MAshimori, AAkahoshi, FYoshimura, TInoue, YFukaya, CNakajima, MFukuyama, HImada, TTakai, SShiota, NMiyazaki, MNakamura, N Peptidyl human heart chymase inhibitors. 1. Synthesis and inhibitory activity of difluoromethylene ketone derivatives bearing P' binding subsites. Bioorg Med Chem Lett 8:913-8 (1999)  
Target
Name:
Chymase
Synonyms:
Alpha-chymase CMA1_HUMAN CYM Mast cell protease I
Type:
Enzyme
Mol. Mass.:
27340.12
Organism:
Homo sapiens (Human)
Description:
Residue:
247
  
Inhibitor
Name:
BDBM50068909
Synonyms:
3-(2,2-Difluoro-4-{[(S)-1-((S)-2-methanesulfonylamino-3-methyl-butyryl)-pyrrolidine-2-carbonyl]-amino}-3-oxo-5-phenyl-pentanoylamino)-benzoic acid | CHEMBL171801
Type:
Small organic molecule
Emp. Form.:
C29H34F2N4O8S
Mol. Mass.:
636.664
SMILES:
CC(C)[C@H](NS(C)(=O)=O)C(=O)N1CCC[C@H]1C(=O)NC(Cc1ccccc1)C(=O)C(F)(F)C(=O)Nc1cccc(c1)C(O)=O
: