Target
Chymase
Ligand
BDBM50068913
Substrate
Meas. Tech.
ChEBML_49443
Ki
21±n/a nM
Citation
 Eda, MAshimori, AAkahoshi, FYoshimura, TInoue, YFukaya, CNakajima, MFukuyama, HImada, TTakai, SShiota, NMiyazaki, MNakamura, N Peptidyl human heart chymase inhibitors. 2. Discovery of highly selective difluoromethylene ketone derivatives with Glu at P3 site. Bioorg Med Chem Lett 8:919-24 (1999)  
Target
Name:
Chymase
Synonyms:
Alpha-chymase CMA1_HUMAN CYM Mast cell protease I
Type:
Enzyme
Mol. Mass.:
27340.12
Organism:
Homo sapiens (Human)
Description:
Residue:
247
  
Inhibitor
Name:
BDBM50068913
Synonyms:
5-{(S)-2-[1-Benzyl-3-(3-carbamoyl-phenylcarbamoyl)-3,3-difluoro-2-oxo-propylcarbamoyl]-pyrrolidin-1-yl}-4-tert-butoxycarbonylamino-5-oxo-pentanoic acid | CHEMBL366721
Type:
Small organic molecule
Emp. Form.:
C33H39F2N5O9
Mol. Mass.:
687.6877
SMILES:
CC(C)(C)OC(=O)NC(CCC(O)=O)C(=O)N1CCC[C@H]1C(=O)NC(Cc1ccccc1)C(=O)C(F)(F)C(=O)Nc1cccc(c1)C(N)=O
: