Target
Matrix metalloproteinase-9
Ligand
BDBM50069213
Substrate
Meas. Tech.
ChEBML_105373
Ki
1±n/a nM
Citation
 Jacobson, ICReddy, PGWasserman, ZRHardman, KDCovington, MBArner, ECCopeland, RADecicco, CPMagolda, RL Structure-based design and synthesis of a series of hydroxamic acids with a quaternary-hydroxy group in P1 as inhibitors of matrix metalloproteinases. Bioorg Med Chem Lett 8:837-42 (1999)  
Target
Name:
Matrix metalloproteinase-9
Synonyms:
67 kDa matrix metalloproteinase-9 92 kDa gelatinase CLG4B Gelatinase B MMP9 Matrix metalloproteinase 9 (MMP-9) Matrix metalloproteinase-9 (MMP9)
Type:
Enzyme
Mol. Mass.:
78452.28
Organism:
Homo sapiens (Human)
Description:
P14780
Residue:
707
  
Inhibitor
Name:
BDBM50069213
Synonyms:
(2R,3R)-N*4*-((S)-5-Amino-1-phenethylcarbamoyl-pentyl)-2,N*1*-dihydroxy-2-methyl-3-(3-phenyl-propyl)-succinamide | CHEMBL167233
Type:
Small organic molecule
Emp. Form.:
C28H40N4O5
Mol. Mass.:
512.641
SMILES:
C[C@@](O)([C@@H](CCCc1ccccc1)C(=O)N[C@@H](CCCCN)C(=O)NCCc1ccccc1)C(=O)NO
: