Target
Matrix metalloproteinase-9
Ligand
BDBM50069228
Substrate
Meas. Tech.
ChEMBL_105373 (CHEMBL712452)
Ki
<1±n/a nM
Citation
 Jacobson, ICReddy, PGWasserman, ZRHardman, KDCovington, MBArner, ECCopeland, RADecicco, CPMagolda, RL Structure-based design and synthesis of a series of hydroxamic acids with a quaternary-hydroxy group in P1 as inhibitors of matrix metalloproteinases. Bioorg Med Chem Lett 8:837-42 (1999)  
Target
Name:
Matrix metalloproteinase-9
Synonyms:
67 kDa matrix metalloproteinase-9 92 kDa gelatinase CLG4B Gelatinase B MMP9 Matrix metalloproteinase 9 (MMP-9) Matrix metalloproteinase-9 (MMP9)
Type:
Enzyme
Mol. Mass.:
78452.28
Organism:
Homo sapiens (Human)
Description:
P14780
Residue:
707
  
Inhibitor
Name:
BDBM50069228
Synonyms:
(2R,3R)-2,N*1*-Dihydroxy-N*4*-[(S)-2-(4-methoxy-phenyl)-1-methylcarbamoyl-ethyl]-2-methyl-3-(3-phenyl-propyl)-succinamide | CHEMBL168802
Type:
Small organic molecule
Emp. Form.:
C25H33N3O6
Mol. Mass.:
471.546
SMILES:
CNC(=O)[C@H](Cc1ccc(OC)cc1)NC(=O)[C@H](CCCc1ccccc1)[C@@](C)(O)C(=O)NO
: