Target
Acetylcholinesterase
Ligand
BDBM8960
Substrate
Meas. Tech.
ChEMBL_27807 (CHEMBL636517)
IC50
6±n/a nM
Citation
 Perola, ECellai, LBrufani, M Synthesis and activity studies of N-[omega-N'-(adamant-1'-yl)aminoalkyl]- 2-(4'-dimethylaminophenyl)acetamides: in the search of selective inhibitors for the different molecular forms of acetylcholinesterase. Bioorg Med Chem Lett 8:575-80 (1999)  
Target
Name:
Acetylcholinesterase
Synonyms:
ACES_BOVIN Acetylcholinesterase (AChE) | Acetylcholinesterase precursor
Type:
Enzyme
Mol. Mass.:
67659.62
Organism:
Bos taurus (bovine)
Description:
Residue:
613
  
Inhibitor
Name:
BDBM8960
Synonyms:
(+/-)-2-[(1-benzylpiperidin-4-yl)methyl]-5,6-dimethoxy-indan-1-one Aricept CHEMBL1678 CHEMBL502 Donepezil E2020 US9346818, DPH US9663465, Donepezil
Type:
Small organic molecule
Emp. Form.:
C24H29NO3
Mol. Mass.:
379.492
SMILES:
COc1cc2CC(CC3CCN(Cc4ccccc4)CC3)C(=O)c2cc1OC
: