Target
Prothrombin
Ligand
BDBM50069294
Substrate
Meas. Tech.
ChEBML_208352
Ki
0.380000±n/a nM
Citation
 Oh, YSYun, MHwang, SYHong, SShin, YLee, KYoon, KHYoo, YJKim, DSLee, SHLee, YHPark, HDLee, CHLee, SKKim, S Discovery of LB30057, a benzamidrazone-based selective oral thrombin inhibitor. Bioorg Med Chem Lett 8:631-4 (1999)  
Target
Name:
Prothrombin
Synonyms:
Activation peptide fragment 1 Coagulation factor II Prothrombin precursor Thrombin heavy chain | Thrombin light chain
Type:
Protein
Mol. Mass.:
70029.57
Organism:
Homo sapiens (Human)
Description:
P00734
Residue:
622
  
Inhibitor
Name:
BDBM50069294
Synonyms:
(S)-3-[4-(carbohydrazonamidol)-phenyl]-N-cyclopentyl-N-methyl-2-(naphthalene-2-sulfonylamino)-propionamide 1N-cyclopentyl-1N-methyl-3-(4-Carbohydrazonamidephenyl)-2-(2-naphthylsulfonamido)-(2S)-propanamide Benzamidrazone analogue N-methyl-N-cyclopentyl-3-(4-hydrazonoformamidephenyl)-2-[(2-naphthylsulfonyl)amino]propanamide
Type:
Small organic molecule
Emp. Form.:
C26H31N5O3S
Mol. Mass.:
493.621
SMILES:
CN(C1CCCC1)C(=O)[C@H](Cc1ccc(cc1)C(N)=NN)NS(=O)(=O)c1ccc2ccccc2c1
: