Target
Type-1 angiotensin II receptor
Ligand
BDBM50282396
Substrate
Meas. Tech.
ChEMBL_1857651 (CHEMBL4358380)
Ki
12±n/a nM
Citation
 Juillerat-Jeanneret, L The Other Angiotensin II Receptor: AT J Med Chem 63:1978-1995 (2020)  
Target
Name:
Type-1 angiotensin II receptor
Synonyms:
AGTR1 AGTR1B AT1 AT1BR AT2R1B Angiotensin II receptor Type-1 angiotensin II receptor (AT1)
Type:
Protein
Mol. Mass.:
41080.75
Organism:
Homo sapiens (Human)
Description:
P30556
Residue:
359
  
Inhibitor
Name:
BDBM50282396
Synonyms:
(S)-1-(4-Dimethylamino-3-methyl-benzyl)-5-diphenylacetyl-4,5,6,7-tetrahydro-1H-imidazo[4,5-c]pyridine-6-carboxylic acid PD-123319
Type:
Small organic molecule
Emp. Form.:
C31H32N4O3
Mol. Mass.:
508.6108
SMILES:
CN(C)c1ccc(Cn2cnc3CN([C@@H](Cc23)C(O)=O)C(=O)C(c2ccccc2)c2ccccc2)cc1C
: