Target
Type-1 angiotensin II receptor A
Ligand
BDBM50514581
Substrate
Meas. Tech.
ChEMBL_1857650 (CHEMBL4358379)
Ki
1700±n/a nM
Citation
 Juillerat-Jeanneret, L The Other Angiotensin II Receptor: AT J Med Chem 63:1978-1995 (2020)  
Target
Name:
Type-1 angiotensin II receptor A
Synonyms:
AGTRA_RAT Agtr1 Angiotensin II AT1 Angiotensin II receptor (AT-1) type-1 Type-1A angiotensin II receptor
Type:
Enzyme Catalytic Domain
Mol. Mass.:
40910.53
Organism:
RAT
Description:
ANGIOTENSIN AT1 AGTR1 RAT::P25095
Residue:
359
  
Inhibitor
Name:
BDBM50514581
Synonyms:
CHEMBL1885579
Type:
Small organic molecule
Emp. Form.:
C52H69N13O11
Mol. Mass.:
1052.1848
SMILES:
CC[C@H](C)[C@H](NC(=O)[C@@H]1CCCN1C(=O)[C@H](Cc1c[nH]cn1)NC(=O)[C@H](CCCCNC(=O)[C@H](CCCN=C(N)N)NC(=O)OCc1ccccc1)NC(=O)[C@H](Cc1ccc(O)cc1)NC(=O)c1cccnc1)C(O)=O
: