Target
Type-1 angiotensin II receptor
Ligand
BDBM50049182
Substrate
Meas. Tech.
ChEMBL_1857651 (CHEMBL4358380)
IC50
39±n/a nM
Citation
 Juillerat-Jeanneret, L The Other Angiotensin II Receptor: AT J Med Chem 63:1978-1995 (2020)  
Target
Name:
Type-1 angiotensin II receptor
Synonyms:
AGTR1 AGTR1B AT1 AT1BR AT2R1B Angiotensin II receptor Type-1 angiotensin II receptor (AT1)
Type:
Protein
Mol. Mass.:
41080.75
Organism:
Homo sapiens (Human)
Description:
P30556
Residue:
359
  
Inhibitor
Name:
BDBM50049182
Synonyms:
(S)-5-Benzyloxy-2-diphenylacetyl-6-methoxy-1,2,3,4-tetrahydro-isoquinoline-3-carboxylic acid PD-126055
Type:
Small organic molecule
Emp. Form.:
C32H29NO5
Mol. Mass.:
507.5764
SMILES:
COc1ccc2CN([C@@H](Cc2c1OCc1ccccc1)C(O)=O)C(=O)C(c1ccccc1)c1ccccc1
: