Target
Type-2 angiotensin II receptor
Ligand
BDBM50514582
Substrate
Meas. Tech.
ChEMBL_1857653 (CHEMBL4358382)
IC50
75±n/a nM
Citation
 Juillerat-Jeanneret, L The Other Angiotensin II Receptor: AT J Med Chem 63:1978-1995 (2020)  
Target
Name:
Type-2 angiotensin II receptor
Synonyms:
AGTR2_RAT Agtr2 Angiotensin II receptor Type-2 angiotensin II receptor
Type:
Enzyme Catalytic Domain
Mol. Mass.:
41346.62
Organism:
RAT
Description:
Angiotensin II AT2 0 0::P35351
Residue:
363
  
Inhibitor
Name:
BDBM50514582
Synonyms:
CHEMBL155836
Type:
Small organic molecule
Emp. Form.:
C32H29NO5
Mol. Mass.:
507.5764
SMILES:
COc1ccc2CN(C(Cc2c1OCc1ccccc1)C(O)=O)C(=O)C(c1ccccc1)c1ccccc1
: