Target
Cathepsin B
Ligand
BDBM50069984
Substrate
Meas. Tech.
ChEBML_47627
Ki
6.1±n/a nM
Citation
 Adams, JBehnke, MChen, SCruickshank, AADick, LRGrenier, LKlunder, JMMa, YTPlamondon, LStein, RL Potent and selective inhibitors of the proteasome: dipeptidyl boronic acids. Bioorg Med Chem Lett 8:333-8 (1999)  
Target
Name:
Cathepsin B
Synonyms:
APP secretase CATB_HUMAN CTSB Cathepsin B light chain | Cathepsin B1
Type:
Enzyme
Mol. Mass.:
37819.69
Organism:
Homo sapiens (Human)
Description:
gi_63102437
Residue:
339
  
Inhibitor
Name:
BDBM50069984
Synonyms:
(R)-1-((S)-2-((S)-2-(benzyloxycarbonyl)-4-methylpentanamido)-4-methylpentanamido)-3-methylbutylboronic acid Dipeptidyl boronic acid derivative
Type:
Small organic molecule
Emp. Form.:
C25H42BN3O6
Mol. Mass.:
491.428
SMILES:
CC(C)C[C@H](NC(=O)[C@H](CC(C)C)NC(=O)[C@H](CC(C)C)NC(=O)OCc1ccccc1)B(O)O
: