Target
Cytochrome P450 2C9
Ligand
BDBM222178
Substrate
Meas. Tech.
ChEMBL_1858695 (CHEMBL4359424)
IC50
346±n/a nM
Citation
 Kang, DFeng, DSun, YFang, ZWei, FDe Clercq, EPannecouque, CLiu, XZhan, P Structure-Based Bioisosterism Yields HIV-1 NNRTIs with Improved Drug-Resistance Profiles and Favorable Pharmacokinetic Properties. J Med Chem 63:4837-4848 (2020)  
Target
Name:
Cytochrome P450 2C9
Synonyms:
(R)-limonene 6-monooxygenase CP2C9_HUMAN CYP2C9 Cytochrome P450 2C9 (CYP2C9 ) P-450MP P450 PB-1 | S-mephenytoin 4-hydroxylase
Type:
Enzyme
Mol. Mass.:
55636.33
Organism:
Homo sapiens (Human)
Description:
P11712
Residue:
490
  
Inhibitor
Name:
BDBM222178
Synonyms:
Rilpivirine
Type:
Small organic molecule
Emp. Form.:
C22H18N6
Mol. Mass.:
366.4185
SMILES:
Cc1cc(\C=C\C#N)cc(C)c1Nc1ccnc(Nc2ccc(cc2)C#N)n1
: